{"text_format":"3","workbook":"xlsx","n_sheets":2,"sheets":["Pendenzenliste","REALVIEW"],"read":"whole","date_system":"1900"}

{"sheet":"Pendenzenliste","index":0,"n_rows":5,"n_cols":15,"rows_kept":5}
["ACHTUNG: die gelben Spalten dürfen nicht bearbeitet werden",{"$nulls":8},"Die Projektstruktur und der Unternehmer müssen identisch zu den Bezeichnungen im REALVIEW sein"]
[]
["Nr","Abnahmeart","Unternehmer","Projektstruktur","Raum","Bezeichnung","Bemerkung","Feststelldatum","Behebungsfrist","Status","_ID_Projekt","_ID_Abnahmeart","_ID_Adresse","_ID_Gebäudestruktur","_ID_Status"]
[8,"Intern","0000 - REALVIEW AG","WHG 1","Küche","Hick in der Wand","Prio 1","2021-09-16","2021-09-21","offen",null,{"$f":"VLOOKUP(B4,REALVIEW!$A$5:$B$99,2,FALSE)","v":0},{"$f":"VLOOKUP(C4,REALVIEW!$G$5:$H$999,2, FALSE)","v":0},{"$f":"VLOOKUP(D4,REALVIEW!$E$5:$F$999,2,FALSE)","v":0},{"$f":"VLOOKUP(J4,REALVIEW!$C$5:$D$99,2,FALSE)","v":0}]
[9,"QS-Rundgang","270 - REALVIEW AG","WHG 2",null,"Griff falsch montiert",null,"2021-09-16","2021-10-28","offen",null,{"$f":"VLOOKUP(B5,REALVIEW!$A$5:$B$99,2,FALSE)","v":0},{"$f":"VLOOKUP(C5,REALVIEW!$G$5:$H$999,2, FALSE)","v":0},{"$f":"VLOOKUP(D5,REALVIEW!$E$5:$F$999,2,FALSE)","v":0},{"$f":"VLOOKUP(J5,REALVIEW!$C$5:$D$99,2,FALSE)","v":0}]

{"sheet":"REALVIEW","index":1,"n_rows":6,"n_cols":8,"rows_kept":6}
["!!! NUR FÜR REALVIEW !!!",{"$nulls":3},"Projektstruktur und Unternehmer aus Projekt exportieren"]
[]
["ABNAHME",null,"STATUS",null,"PROJEKTSTRUKTUR",null,"UNTERNEHMER"]
["Abnahmeart","ID_Abnahme","Status","ID_Status","Bereich","ID_Struktur","BER_Firmenbezeichnung","ID_Adresse"]
["Intern",null,"Offen",null,"WHG 1",null,"0000 - REALVIEW AG"]
["QS-Rundgang",null,"BL kontrolliert",null,"WHG 2",null,"270 - REALVIEW AG"]