{"text_format":"3","workbook":"xlsx","n_sheets":2,"sheets":["Zugänge","REALVIEW"],"read":"whole","date_system":"1900"}

{"sheet":"Zugänge","index":0,"n_rows":999,"n_cols":7,"rows_kept":999}
["ACHTUNG: die gelben Spalten dürfen nicht bearbeitet werden",{"$nulls":3},"Die Projektstruktur muss identisch zur Projektstrutkru in den Projekteinstellungen im REALVIEW sein"]
[]
["E-Mail","Vorname","Nachname","Telefon","Projektstruktur","_ID_PROJEKT","_ID_STRUKTUR"]
["maxmuster@beispiel.ch","Max","Muster","044 512 18 00","WHG 1",null,{"$f":"IF(E4=\"\",\"\",(VLOOKUP(E4,REALVIEW!$A$2:$C$5000,3,FALSE)))","v":0}]
["martina.muster@firma.ch","Martina","Muster",null,"WHG 2",null,{"$f":"IF(E5=\"\",\"\",(VLOOKUP(E5,REALVIEW!$A$2:$C$5000,3,FALSE)))","v":0}]
[{"$nulls":6},{"$f":"IF(E6=\"\",\"\",(VLOOKUP(E6,REALVIEW!$A$2:$C$5000,3,FALSE)))","v":""}]
[{"$nulls":6},{"$f":"IF(E7=\"\",\"\",(VLOOKUP(E7,REALVIEW!$A$2:$C$5000,3,FALSE)))","v":""}]
[{"$nulls":6},{"$f":"IF(E8=\"\",\"\",(VLOOKUP(E8,REALVIEW!$A$2:$C$5000,3,FALSE)))","v":""}]
[{"$nulls":6},{"$f":"IF(E9=\"\",\"\",(VLOOKUP(E9,REALVIEW!$A$2:$C$5000,3,FALSE)))","v":""}]
[{"$nulls":6},{"$f":"IF(E10=\"\",\"\",(VLOOKUP(E10,REALVIEW!$A$2:$C$5000,3,FALSE)))","v":""}]
[{"$nulls":6},{"$f":"IF(E11=\"\",\"\",(VLOOKUP(E11,REALVIEW!$A$2:$C$5000,3,FALSE)))","v":""}]
[{"$nulls":6},{"$f":"IF(E12=\"\",\"\",(VLOOKUP(E12,REALVIEW!$A$2:$C$5000,3,FALSE)))","v":""}]
[{"$nulls":6},{"$f":"IF(E13=\"\",\"\",(VLOOKUP(E13,REALVIEW!$A$2:$C$5000,3,FALSE)))","v":""}]
[{"$nulls":6},{"$f":"IF(E14=\"\",\"\",(VLOOKUP(E14,REALVIEW!$A$2:$C$5000,3,FALSE)))","v":""}]
[{"$nulls":6},{"$f":"IF(E15=\"\",\"\",(VLOOKUP(E15,REALVIEW!$A$2:$C$5000,3,FALSE)))","v":""}]
[{"$nulls":6},{"$f":"IF(E16=\"\",\"\",(VLOOKUP(E16,REALVIEW!$A$2:$C$5000,3,FALSE)))","v":""}]
[{"$nulls":6},{"$f":"IF(E17=\"\",\"\",(VLOOKUP(E17,REALVIEW!$A$2:$C$5000,3,FALSE)))","v":""}]
[{"$nulls":6},{"$f":"IF(E18=\"\",\"\",(VLOOKUP(E18,REALVIEW!$A$2:$C$5000,3,FALSE)))","v":""}]
[{"$nulls":6},{"$f":"IF(E19=\"\",\"\",(VLOOKUP(E19,REALVIEW!$A$2:$C$5000,3,FALSE)))","v":""}]
[{"$nulls":6},{"$f":"IF(E20=\"\",\"\",(VLOOKUP(E20,REALVIEW!$A$2:$C$5000,3,FALSE)))","v":""}]
[{"$nulls":6},{"$f":"IF(E21=\"\",\"\",(VLOOKUP(E21,REALVIEW!$A$2:$C$5000,3,FALSE)))","v":""}]
[{"$nulls":6},{"$f":"IF(E22=\"\",\"\",(VLOOKUP(E22,REALVIEW!$A$2:$C$5000,3,FALSE)))","v":""}]
[{"$nulls":6},{"$f":"IF(E23=\"\",\"\",(VLOOKUP(E23,REALVIEW!$A$2:$C$5000,3,FALSE)))","v":""}]
[{"$nulls":6},{"$f":"IF(E24=\"\",\"\",(VLOOKUP(E24,REALVIEW!$A$2:$C$5000,3,FALSE)))","v":""}]
[{"$nulls":6},{"$f":"IF(E25=\"\",\"\",(VLOOKUP(E25,REALVIEW!$A$2:$C$5000,3,FALSE)))","v":""}]
[{"$nulls":6},{"$f":"IF(E26=\"\",\"\",(VLOOKUP(E26,REALVIEW!$A$2:$C$5000,3,FALSE)))","v":""}]
[{"$nulls":6},{"$f":"IF(E27=\"\",\"\",(VLOOKUP(E27,REALVIEW!$A$2:$C$5000,3,FALSE)))","v":""}]
[{"$nulls":6},{"$f":"IF(E28=\"\",\"\",(VLOOKUP(E28,REALVIEW!$A$2:$C$5000,3,FALSE)))","v":""}]
[{"$nulls":6},{"$f":"IF(E29=\"\",\"\",(VLOOKUP(E29,REALVIEW!$A$2:$C$5000,3,FALSE)))","v":""}]
[{"$nulls":6},{"$f":"IF(E30=\"\",\"\",(VLOOKUP(E30,REALVIEW!$A$2:$C$5000,3,FALSE)))","v":""}]
[{"$nulls":6},{"$f":"IF(E31=\"\",\"\",(VLOOKUP(E31,REALVIEW!$A$2:$C$5000,3,FALSE)))","v":""}]
[{"$nulls":6},{"$f":"IF(E32=\"\",\"\",(VLOOKUP(E32,REALVIEW!$A$2:$C$5000,3,FALSE)))","v":""}]
[{"$nulls":6},{"$f":"IF(E33=\"\",\"\",(VLOOKUP(E33,REALVIEW!$A$2:$C$5000,3,FALSE)))","v":""}]
[{"$nulls":6},{"$f":"IF(E34=\"\",\"\",(VLOOKUP(E34,REALVIEW!$A$2:$C$5000,3,FALSE)))","v":""}]
[{"$nulls":6},{"$f":"IF(E35=\"\",\"\",(VLOOKUP(E35,REALVIEW!$A$2:$C$5000,3,FALSE)))","v":""}]
[{"$nulls":6},{"$f":"IF(E36=\"\",\"\",(VLOOKUP(E36,REALVIEW!$A$2:$C$5000,3,FALSE)))","v":""}]
[{"$nulls":6},{"$f":"IF(E37=\"\",\"\",(VLOOKUP(E37,REALVIEW!$A$2:$C$5000,3,FALSE)))","v":""}]
[{"$nulls":6},{"$f":"IF(E38=\"\",\"\",(VLOOKUP(E38,REALVIEW!$A$2:$C$5000,3,FALSE)))","v":""}]
[{"$nulls":6},{"$f":"IF(E39=\"\",\"\",(VLOOKUP(E39,REALVIEW!$A$2:$C$5000,3,FALSE)))","v":""}]
[{"$nulls":6},{"$f":"IF(E40=\"\",\"\",(VLOOKUP(E40,REALVIEW!$A$2:$C$5000,3,FALSE)))","v":""}]
[{"$nulls":6},{"$f":"IF(E41=\"\",\"\",(VLOOKUP(E41,REALVIEW!$A$2:$C$5000,3,FALSE)))","v":""}]
[{"$nulls":6},{"$f":"IF(E42=\"\",\"\",(VLOOKUP(E42,REALVIEW!$A$2:$C$5000,3,FALSE)))","v":""}]
[{"$nulls":6},{"$f":"IF(E43=\"\",\"\",(VLOOKUP(E43,REALVIEW!$A$2:$C$5000,3,FALSE)))","v":""}]
[{"$nulls":6},{"$f":"IF(E44=\"\",\"\",(VLOOKUP(E44,REALVIEW!$A$2:$C$5000,3,FALSE)))","v":""}]
[{"$nulls":6},{"$f":"IF(E45=\"\",\"\",(VLOOKUP(E45,REALVIEW!$A$2:$C$5000,3,FALSE)))","v":""}]
[{"$nulls":6},{"$f":"IF(E46=\"\",\"\",(VLOOKUP(E46,REALVIEW!$A$2:$C$5000,3,FALSE)))","v":""}]
[{"$nulls":6},{"$f":"IF(E47=\"\",\"\",(VLOOKUP(E47,REALVIEW!$A$2:$C$5000,3,FALSE)))","v":""}]
[{"$nulls":6},{"$f":"IF(E48=\"\",\"\",(VLOOKUP(E48,REALVIEW!$A$2:$C$5000,3,FALSE)))","v":""}]
[{"$nulls":6},{"$f":"IF(E49=\"\",\"\",(VLOOKUP(E49,REALVIEW!$A$2:$C$5000,3,FALSE)))","v":""}]
[{"$nulls":6},{"$f":"IF(E50=\"\",\"\",(VLOOKUP(E50,REALVIEW!$A$2:$C$5000,3,FALSE)))","v":""}]
[{"$nulls":6},{"$f":"IF(E51=\"\",\"\",(VLOOKUP(E51,REALVIEW!$A$2:$C$5000,3,FALSE)))","v":""}]
[{"$nulls":6},{"$f":"IF(E52=\"\",\"\",(VLOOKUP(E52,REALVIEW!$A$2:$C$5000,3,FALSE)))","v":""}]
[{"$nulls":6},{"$f":"IF(E53=\"\",\"\",(VLOOKUP(E53,REALVIEW!$A$2:$C$5000,3,FALSE)))","v":""}]
[{"$nulls":6},{"$f":"IF(E54=\"\",\"\",(VLOOKUP(E54,REALVIEW!$A$2:$C$5000,3,FALSE)))","v":""}]
[{"$nulls":6},{"$f":"IF(E55=\"\",\"\",(VLOOKUP(E55,REALVIEW!$A$2:$C$5000,3,FALSE)))","v":""}]
[{"$nulls":6},{"$f":"IF(E56=\"\",\"\",(VLOOKUP(E56,REALVIEW!$A$2:$C$5000,3,FALSE)))","v":""}]
[{"$nulls":6},{"$f":"IF(E57=\"\",\"\",(VLOOKUP(E57,REALVIEW!$A$2:$C$5000,3,FALSE)))","v":""}]
[{"$nulls":6},{"$f":"IF(E58=\"\",\"\",(VLOOKUP(E58,REALVIEW!$A$2:$C$5000,3,FALSE)))","v":""}]
[{"$nulls":6},{"$f":"IF(E59=\"\",\"\",(VLOOKUP(E59,REALVIEW!$A$2:$C$5000,3,FALSE)))","v":""}]
[{"$nulls":6},{"$f":"IF(E60=\"\",\"\",(VLOOKUP(E60,REALVIEW!$A$2:$C$5000,3,FALSE)))","v":""}]
[{"$nulls":6},{"$f":"IF(E61=\"\",\"\",(VLOOKUP(E61,REALVIEW!$A$2:$C$5000,3,FALSE)))","v":""}]
[{"$nulls":6},{"$f":"IF(E62=\"\",\"\",(VLOOKUP(E62,REALVIEW!$A$2:$C$5000,3,FALSE)))","v":""}]
[{"$nulls":6},{"$f":"IF(E63=\"\",\"\",(VLOOKUP(E63,REALVIEW!$A$2:$C$5000,3,FALSE)))","v":""}]
[{"$nulls":6},{"$f":"IF(E64=\"\",\"\",(VLOOKUP(E64,REALVIEW!$A$2:$C$5000,3,FALSE)))","v":""}]
[{"$nulls":6},{"$f":"IF(E65=\"\",\"\",(VLOOKUP(E65,REALVIEW!$A$2:$C$5000,3,FALSE)))","v":""}]
[{"$nulls":6},{"$f":"IF(E66=\"\",\"\",(VLOOKUP(E66,REALVIEW!$A$2:$C$5000,3,FALSE)))","v":""}]
[{"$nulls":6},{"$f":"IF(E67=\"\",\"\",(VLOOKUP(E67,REALVIEW!$A$2:$C$5000,3,FALSE)))","v":""}]
[{"$nulls":6},{"$f":"IF(E68=\"\",\"\",(VLOOKUP(E68,REALVIEW!$A$2:$C$5000,3,FALSE)))","v":""}]
[{"$nulls":6},{"$f":"IF(E69=\"\",\"\",(VLOOKUP(E69,REALVIEW!$A$2:$C$5000,3,FALSE)))","v":""}]
[{"$nulls":6},{"$f":"IF(E70=\"\",\"\",(VLOOKUP(E70,REALVIEW!$A$2:$C$5000,3,FALSE)))","v":""}]
[{"$nulls":6},{"$f":"IF(E71=\"\",\"\",(VLOOKUP(E71,REALVIEW!$A$2:$C$5000,3,FALSE)))","v":""}]
[{"$nulls":6},{"$f":"IF(E72=\"\",\"\",(VLOOKUP(E72,REALVIEW!$A$2:$C$5000,3,FALSE)))","v":""}]
[{"$nulls":6},{"$f":"IF(E73=\"\",\"\",(VLOOKUP(E73,REALVIEW!$A$2:$C$5000,3,FALSE)))","v":""}]
[{"$nulls":6},{"$f":"IF(E74=\"\",\"\",(VLOOKUP(E74,REALVIEW!$A$2:$C$5000,3,FALSE)))","v":""}]
[{"$nulls":6},{"$f":"IF(E75=\"\",\"\",(VLOOKUP(E75,REALVIEW!$A$2:$C$5000,3,FALSE)))","v":""}]
[{"$nulls":6},{"$f":"IF(E76=\"\",\"\",(VLOOKUP(E76,REALVIEW!$A$2:$C$5000,3,FALSE)))","v":""}]
[{"$nulls":6},{"$f":"IF(E77=\"\",\"\",(VLOOKUP(E77,REALVIEW!$A$2:$C$5000,3,FALSE)))","v":""}]
[{"$nulls":6},{"$f":"IF(E78=\"\",\"\",(VLOOKUP(E78,REALVIEW!$A$2:$C$5000,3,FALSE)))","v":""}]
[{"$nulls":6},{"$f":"IF(E79=\"\",\"\",(VLOOKUP(E79,REALVIEW!$A$2:$C$5000,3,FALSE)))","v":""}]
[{"$nulls":6},{"$f":"IF(E80=\"\",\"\",(VLOOKUP(E80,REALVIEW!$A$2:$C$5000,3,FALSE)))","v":""}]
[{"$nulls":6},{"$f":"IF(E81=\"\",\"\",(VLOOKUP(E81,REALVIEW!$A$2:$C$5000,3,FALSE)))","v":""}]
[{"$nulls":6},{"$f":"IF(E82=\"\",\"\",(VLOOKUP(E82,REALVIEW!$A$2:$C$5000,3,FALSE)))","v":""}]
[{"$nulls":6},{"$f":"IF(E83=\"\",\"\",(VLOOKUP(E83,REALVIEW!$A$2:$C$5000,3,FALSE)))","v":""}]
[{"$nulls":6},{"$f":"IF(E84=\"\",\"\",(VLOOKUP(E84,REALVIEW!$A$2:$C$5000,3,FALSE)))","v":""}]
[{"$nulls":6},{"$f":"IF(E85=\"\",\"\",(VLOOKUP(E85,REALVIEW!$A$2:$C$5000,3,FALSE)))","v":""}]
[{"$nulls":6},{"$f":"IF(E86=\"\",\"\",(VLOOKUP(E86,REALVIEW!$A$2:$C$5000,3,FALSE)))","v":""}]
[{"$nulls":6},{"$f":"IF(E87=\"\",\"\",(VLOOKUP(E87,REALVIEW!$A$2:$C$5000,3,FALSE)))","v":""}]
[{"$nulls":6},{"$f":"IF(E88=\"\",\"\",(VLOOKUP(E88,REALVIEW!$A$2:$C$5000,3,FALSE)))","v":""}]
[{"$nulls":6},{"$f":"IF(E89=\"\",\"\",(VLOOKUP(E89,REALVIEW!$A$2:$C$5000,3,FALSE)))","v":""}]
[{"$nulls":6},{"$f":"IF(E90=\"\",\"\",(VLOOKUP(E90,REALVIEW!$A$2:$C$5000,3,FALSE)))","v":""}]
[{"$nulls":6},{"$f":"IF(E91=\"\",\"\",(VLOOKUP(E91,REALVIEW!$A$2:$C$5000,3,FALSE)))","v":""}]
[{"$nulls":6},{"$f":"IF(E92=\"\",\"\",(VLOOKUP(E92,REALVIEW!$A$2:$C$5000,3,FALSE)))","v":""}]
[{"$nulls":6},{"$f":"IF(E93=\"\",\"\",(VLOOKUP(E93,REALVIEW!$A$2:$C$5000,3,FALSE)))","v":""}]
[{"$nulls":6},{"$f":"IF(E94=\"\",\"\",(VLOOKUP(E94,REALVIEW!$A$2:$C$5000,3,FALSE)))","v":""}]
[{"$nulls":6},{"$f":"IF(E95=\"\",\"\",(VLOOKUP(E95,REALVIEW!$A$2:$C$5000,3,FALSE)))","v":""}]
[{"$nulls":6},{"$f":"IF(E96=\"\",\"\",(VLOOKUP(E96,REALVIEW!$A$2:$C$5000,3,FALSE)))","v":""}]
[{"$nulls":6},{"$f":"IF(E97=\"\",\"\",(VLOOKUP(E97,REALVIEW!$A$2:$C$5000,3,FALSE)))","v":""}]
[{"$nulls":6},{"$f":"IF(E98=\"\",\"\",(VLOOKUP(E98,REALVIEW!$A$2:$C$5000,3,FALSE)))","v":""}]
[{"$nulls":6},{"$f":"IF(E99=\"\",\"\",(VLOOKUP(E99,REALVIEW!$A$2:$C$5000,3,FALSE)))","v":""}]
[{"$nulls":6},{"$f":"IF(E100=\"\",\"\",(VLOOKUP(E100,REALVIEW!$A$2:$C$5000,3,FALSE)))","v":""}]
[{"$nulls":6},{"$f":"IF(E101=\"\",\"\",(VLOOKUP(E101,REALVIEW!$A$2:$C$5000,3,FALSE)))","v":""}]
[{"$nulls":6},{"$f":"IF(E102=\"\",\"\",(VLOOKUP(E102,REALVIEW!$A$2:$C$5000,3,FALSE)))","v":""}]
[{"$nulls":6},{"$f":"IF(E103=\"\",\"\",(VLOOKUP(E103,REALVIEW!$A$2:$C$5000,3,FALSE)))","v":""}]
[{"$nulls":6},{"$f":"IF(E104=\"\",\"\",(VLOOKUP(E104,REALVIEW!$A$2:$C$5000,3,FALSE)))","v":""}]
[{"$nulls":6},{"$f":"IF(E105=\"\",\"\",(VLOOKUP(E105,REALVIEW!$A$2:$C$5000,3,FALSE)))","v":""}]
[{"$nulls":6},{"$f":"IF(E106=\"\",\"\",(VLOOKUP(E106,REALVIEW!$A$2:$C$5000,3,FALSE)))","v":""}]
[{"$nulls":6},{"$f":"IF(E107=\"\",\"\",(VLOOKUP(E107,REALVIEW!$A$2:$C$5000,3,FALSE)))","v":""}]
[{"$nulls":6},{"$f":"IF(E108=\"\",\"\",(VLOOKUP(E108,REALVIEW!$A$2:$C$5000,3,FALSE)))","v":""}]
[{"$nulls":6},{"$f":"IF(E109=\"\",\"\",(VLOOKUP(E109,REALVIEW!$A$2:$C$5000,3,FALSE)))","v":""}]
[{"$nulls":6},{"$f":"IF(E110=\"\",\"\",(VLOOKUP(E110,REALVIEW!$A$2:$C$5000,3,FALSE)))","v":""}]
[{"$nulls":6},{"$f":"IF(E111=\"\",\"\",(VLOOKUP(E111,REALVIEW!$A$2:$C$5000,3,FALSE)))","v":""}]
[{"$nulls":6},{"$f":"IF(E112=\"\",\"\",(VLOOKUP(E112,REALVIEW!$A$2:$C$5000,3,FALSE)))","v":""}]
[{"$nulls":6},{"$f":"IF(E113=\"\",\"\",(VLOOKUP(E113,REALVIEW!$A$2:$C$5000,3,FALSE)))","v":""}]
[{"$nulls":6},{"$f":"IF(E114=\"\",\"\",(VLOOKUP(E114,REALVIEW!$A$2:$C$5000,3,FALSE)))","v":""}]
[{"$nulls":6},{"$f":"IF(E115=\"\",\"\",(VLOOKUP(E115,REALVIEW!$A$2:$C$5000,3,FALSE)))","v":""}]
[{"$nulls":6},{"$f":"IF(E116=\"\",\"\",(VLOOKUP(E116,REALVIEW!$A$2:$C$5000,3,FALSE)))","v":""}]
[{"$nulls":6},{"$f":"IF(E117=\"\",\"\",(VLOOKUP(E117,REALVIEW!$A$2:$C$5000,3,FALSE)))","v":""}]
[{"$nulls":6},{"$f":"IF(E118=\"\",\"\",(VLOOKUP(E118,REALVIEW!$A$2:$C$5000,3,FALSE)))","v":""}]
[{"$nulls":6},{"$f":"IF(E119=\"\",\"\",(VLOOKUP(E119,REALVIEW!$A$2:$C$5000,3,FALSE)))","v":""}]
[{"$nulls":6},{"$f":"IF(E120=\"\",\"\",(VLOOKUP(E120,REALVIEW!$A$2:$C$5000,3,FALSE)))","v":""}]
[{"$nulls":6},{"$f":"IF(E121=\"\",\"\",(VLOOKUP(E121,REALVIEW!$A$2:$C$5000,3,FALSE)))","v":""}]
[{"$nulls":6},{"$f":"IF(E122=\"\",\"\",(VLOOKUP(E122,REALVIEW!$A$2:$C$5000,3,FALSE)))","v":""}]
[{"$nulls":6},{"$f":"IF(E123=\"\",\"\",(VLOOKUP(E123,REALVIEW!$A$2:$C$5000,3,FALSE)))","v":""}]
[{"$nulls":6},{"$f":"IF(E124=\"\",\"\",(VLOOKUP(E124,REALVIEW!$A$2:$C$5000,3,FALSE)))","v":""}]
[{"$nulls":6},{"$f":"IF(E125=\"\",\"\",(VLOOKUP(E125,REALVIEW!$A$2:$C$5000,3,FALSE)))","v":""}]
[{"$nulls":6},{"$f":"IF(E126=\"\",\"\",(VLOOKUP(E126,REALVIEW!$A$2:$C$5000,3,FALSE)))","v":""}]
[{"$nulls":6},{"$f":"IF(E127=\"\",\"\",(VLOOKUP(E127,REALVIEW!$A$2:$C$5000,3,FALSE)))","v":""}]
[{"$nulls":6},{"$f":"IF(E128=\"\",\"\",(VLOOKUP(E128,REALVIEW!$A$2:$C$5000,3,FALSE)))","v":""}]
[{"$nulls":6},{"$f":"IF(E129=\"\",\"\",(VLOOKUP(E129,REALVIEW!$A$2:$C$5000,3,FALSE)))","v":""}]
[{"$nulls":6},{"$f":"IF(E130=\"\",\"\",(VLOOKUP(E130,REALVIEW!$A$2:$C$5000,3,FALSE)))","v":""}]
[{"$nulls":6},{"$f":"IF(E131=\"\",\"\",(VLOOKUP(E131,REALVIEW!$A$2:$C$5000,3,FALSE)))","v":""}]
[{"$nulls":6},{"$f":"IF(E132=\"\",\"\",(VLOOKUP(E132,REALVIEW!$A$2:$C$5000,3,FALSE)))","v":""}]
[{"$nulls":6},{"$f":"IF(E133=\"\",\"\",(VLOOKUP(E133,REALVIEW!$A$2:$C$5000,3,FALSE)))","v":""}]
[{"$nulls":6},{"$f":"IF(E134=\"\",\"\",(VLOOKUP(E134,REALVIEW!$A$2:$C$5000,3,FALSE)))","v":""}]
[{"$nulls":6},{"$f":"IF(E135=\"\",\"\",(VLOOKUP(E135,REALVIEW!$A$2:$C$5000,3,FALSE)))","v":""}]
[{"$nulls":6},{"$f":"IF(E136=\"\",\"\",(VLOOKUP(E136,REALVIEW!$A$2:$C$5000,3,FALSE)))","v":""}]
[{"$nulls":6},{"$f":"IF(E137=\"\",\"\",(VLOOKUP(E137,REALVIEW!$A$2:$C$5000,3,FALSE)))","v":""}]
[{"$nulls":6},{"$f":"IF(E138=\"\",\"\",(VLOOKUP(E138,REALVIEW!$A$2:$C$5000,3,FALSE)))","v":""}]
[{"$nulls":6},{"$f":"IF(E139=\"\",\"\",(VLOOKUP(E139,REALVIEW!$A$2:$C$5000,3,FALSE)))","v":""}]
[{"$nulls":6},{"$f":"IF(E140=\"\",\"\",(VLOOKUP(E140,REALVIEW!$A$2:$C$5000,3,FALSE)))","v":""}]
[{"$nulls":6},{"$f":"IF(E141=\"\",\"\",(VLOOKUP(E141,REALVIEW!$A$2:$C$5000,3,FALSE)))","v":""}]
[{"$nulls":6},{"$f":"IF(E142=\"\",\"\",(VLOOKUP(E142,REALVIEW!$A$2:$C$5000,3,FALSE)))","v":""}]
[{"$nulls":6},{"$f":"IF(E143=\"\",\"\",(VLOOKUP(E143,REALVIEW!$A$2:$C$5000,3,FALSE)))","v":""}]
[{"$nulls":6},{"$f":"IF(E144=\"\",\"\",(VLOOKUP(E144,REALVIEW!$A$2:$C$5000,3,FALSE)))","v":""}]
[{"$nulls":6},{"$f":"IF(E145=\"\",\"\",(VLOOKUP(E145,REALVIEW!$A$2:$C$5000,3,FALSE)))","v":""}]
[{"$nulls":6},{"$f":"IF(E146=\"\",\"\",(VLOOKUP(E146,REALVIEW!$A$2:$C$5000,3,FALSE)))","v":""}]
[{"$nulls":6},{"$f":"IF(E147=\"\",\"\",(VLOOKUP(E147,REALVIEW!$A$2:$C$5000,3,FALSE)))","v":""}]
[{"$nulls":6},{"$f":"IF(E148=\"\",\"\",(VLOOKUP(E148,REALVIEW!$A$2:$C$5000,3,FALSE)))","v":""}]
[{"$nulls":6},{"$f":"IF(E149=\"\",\"\",(VLOOKUP(E149,REALVIEW!$A$2:$C$5000,3,FALSE)))","v":""}]
[{"$nulls":6},{"$f":"IF(E150=\"\",\"\",(VLOOKUP(E150,REALVIEW!$A$2:$C$5000,3,FALSE)))","v":""}]
[{"$nulls":6},{"$f":"IF(E151=\"\",\"\",(VLOOKUP(E151,REALVIEW!$A$2:$C$5000,3,FALSE)))","v":""}]
[{"$nulls":6},{"$f":"IF(E152=\"\",\"\",(VLOOKUP(E152,REALVIEW!$A$2:$C$5000,3,FALSE)))","v":""}]
[{"$nulls":6},{"$f":"IF(E153=\"\",\"\",(VLOOKUP(E153,REALVIEW!$A$2:$C$5000,3,FALSE)))","v":""}]
[{"$nulls":6},{"$f":"IF(E154=\"\",\"\",(VLOOKUP(E154,REALVIEW!$A$2:$C$5000,3,FALSE)))","v":""}]
[{"$nulls":6},{"$f":"IF(E155=\"\",\"\",(VLOOKUP(E155,REALVIEW!$A$2:$C$5000,3,FALSE)))","v":""}]
[{"$nulls":6},{"$f":"IF(E156=\"\",\"\",(VLOOKUP(E156,REALVIEW!$A$2:$C$5000,3,FALSE)))","v":""}]
[{"$nulls":6},{"$f":"IF(E157=\"\",\"\",(VLOOKUP(E157,REALVIEW!$A$2:$C$5000,3,FALSE)))","v":""}]
[{"$nulls":6},{"$f":"IF(E158=\"\",\"\",(VLOOKUP(E158,REALVIEW!$A$2:$C$5000,3,FALSE)))","v":""}]
[{"$nulls":6},{"$f":"IF(E159=\"\",\"\",(VLOOKUP(E159,REALVIEW!$A$2:$C$5000,3,FALSE)))","v":""}]
[{"$nulls":6},{"$f":"IF(E160=\"\",\"\",(VLOOKUP(E160,REALVIEW!$A$2:$C$5000,3,FALSE)))","v":""}]
[{"$nulls":6},{"$f":"IF(E161=\"\",\"\",(VLOOKUP(E161,REALVIEW!$A$2:$C$5000,3,FALSE)))","v":""}]
[{"$nulls":6},{"$f":"IF(E162=\"\",\"\",(VLOOKUP(E162,REALVIEW!$A$2:$C$5000,3,FALSE)))","v":""}]
[{"$nulls":6},{"$f":"IF(E163=\"\",\"\",(VLOOKUP(E163,REALVIEW!$A$2:$C$5000,3,FALSE)))","v":""}]
[{"$nulls":6},{"$f":"IF(E164=\"\",\"\",(VLOOKUP(E164,REALVIEW!$A$2:$C$5000,3,FALSE)))","v":""}]
[{"$nulls":6},{"$f":"IF(E165=\"\",\"\",(VLOOKUP(E165,REALVIEW!$A$2:$C$5000,3,FALSE)))","v":""}]
[{"$nulls":6},{"$f":"IF(E166=\"\",\"\",(VLOOKUP(E166,REALVIEW!$A$2:$C$5000,3,FALSE)))","v":""}]
[{"$nulls":6},{"$f":"IF(E167=\"\",\"\",(VLOOKUP(E167,REALVIEW!$A$2:$C$5000,3,FALSE)))","v":""}]
[{"$nulls":6},{"$f":"IF(E168=\"\",\"\",(VLOOKUP(E168,REALVIEW!$A$2:$C$5000,3,FALSE)))","v":""}]
[{"$nulls":6},{"$f":"IF(E169=\"\",\"\",(VLOOKUP(E169,REALVIEW!$A$2:$C$5000,3,FALSE)))","v":""}]
[{"$nulls":6},{"$f":"IF(E170=\"\",\"\",(VLOOKUP(E170,REALVIEW!$A$2:$C$5000,3,FALSE)))","v":""}]
[{"$nulls":6},{"$f":"IF(E171=\"\",\"\",(VLOOKUP(E171,REALVIEW!$A$2:$C$5000,3,FALSE)))","v":""}]
[{"$nulls":6},{"$f":"IF(E172=\"\",\"\",(VLOOKUP(E172,REALVIEW!$A$2:$C$5000,3,FALSE)))","v":""}]
[{"$nulls":6},{"$f":"IF(E173=\"\",\"\",(VLOOKUP(E173,REALVIEW!$A$2:$C$5000,3,FALSE)))","v":""}]
[{"$nulls":6},{"$f":"IF(E174=\"\",\"\",(VLOOKUP(E174,REALVIEW!$A$2:$C$5000,3,FALSE)))","v":""}]
[{"$nulls":6},{"$f":"IF(E175=\"\",\"\",(VLOOKUP(E175,REALVIEW!$A$2:$C$5000,3,FALSE)))","v":""}]
[{"$nulls":6},{"$f":"IF(E176=\"\",\"\",(VLOOKUP(E176,REALVIEW!$A$2:$C$5000,3,FALSE)))","v":""}]
[{"$nulls":6},{"$f":"IF(E177=\"\",\"\",(VLOOKUP(E177,REALVIEW!$A$2:$C$5000,3,FALSE)))","v":""}]
[{"$nulls":6},{"$f":"IF(E178=\"\",\"\",(VLOOKUP(E178,REALVIEW!$A$2:$C$5000,3,FALSE)))","v":""}]
[{"$nulls":6},{"$f":"IF(E179=\"\",\"\",(VLOOKUP(E179,REALVIEW!$A$2:$C$5000,3,FALSE)))","v":""}]
[{"$nulls":6},{"$f":"IF(E180=\"\",\"\",(VLOOKUP(E180,REALVIEW!$A$2:$C$5000,3,FALSE)))","v":""}]
[{"$nulls":6},{"$f":"IF(E181=\"\",\"\",(VLOOKUP(E181,REALVIEW!$A$2:$C$5000,3,FALSE)))","v":""}]
[{"$nulls":6},{"$f":"IF(E182=\"\",\"\",(VLOOKUP(E182,REALVIEW!$A$2:$C$5000,3,FALSE)))","v":""}]
[{"$nulls":6},{"$f":"IF(E183=\"\",\"\",(VLOOKUP(E183,REALVIEW!$A$2:$C$5000,3,FALSE)))","v":""}]
[{"$nulls":6},{"$f":"IF(E184=\"\",\"\",(VLOOKUP(E184,REALVIEW!$A$2:$C$5000,3,FALSE)))","v":""}]
[{"$nulls":6},{"$f":"IF(E185=\"\",\"\",(VLOOKUP(E185,REALVIEW!$A$2:$C$5000,3,FALSE)))","v":""}]
[{"$nulls":6},{"$f":"IF(E186=\"\",\"\",(VLOOKUP(E186,REALVIEW!$A$2:$C$5000,3,FALSE)))","v":""}]
[{"$nulls":6},{"$f":"IF(E187=\"\",\"\",(VLOOKUP(E187,REALVIEW!$A$2:$C$5000,3,FALSE)))","v":""}]
[{"$nulls":6},{"$f":"IF(E188=\"\",\"\",(VLOOKUP(E188,REALVIEW!$A$2:$C$5000,3,FALSE)))","v":""}]
[{"$nulls":6},{"$f":"IF(E189=\"\",\"\",(VLOOKUP(E189,REALVIEW!$A$2:$C$5000,3,FALSE)))","v":""}]
[{"$nulls":6},{"$f":"IF(E190=\"\",\"\",(VLOOKUP(E190,REALVIEW!$A$2:$C$5000,3,FALSE)))","v":""}]
[{"$nulls":6},{"$f":"IF(E191=\"\",\"\",(VLOOKUP(E191,REALVIEW!$A$2:$C$5000,3,FALSE)))","v":""}]
[{"$nulls":6},{"$f":"IF(E192=\"\",\"\",(VLOOKUP(E192,REALVIEW!$A$2:$C$5000,3,FALSE)))","v":""}]
[{"$nulls":6},{"$f":"IF(E193=\"\",\"\",(VLOOKUP(E193,REALVIEW!$A$2:$C$5000,3,FALSE)))","v":""}]
[{"$nulls":6},{"$f":"IF(E194=\"\",\"\",(VLOOKUP(E194,REALVIEW!$A$2:$C$5000,3,FALSE)))","v":""}]
[{"$nulls":6},{"$f":"IF(E195=\"\",\"\",(VLOOKUP(E195,REALVIEW!$A$2:$C$5000,3,FALSE)))","v":""}]
[{"$nulls":6},{"$f":"IF(E196=\"\",\"\",(VLOOKUP(E196,REALVIEW!$A$2:$C$5000,3,FALSE)))","v":""}]
[{"$nulls":6},{"$f":"IF(E197=\"\",\"\",(VLOOKUP(E197,REALVIEW!$A$2:$C$5000,3,FALSE)))","v":""}]
[{"$nulls":6},{"$f":"IF(E198=\"\",\"\",(VLOOKUP(E198,REALVIEW!$A$2:$C$5000,3,FALSE)))","v":""}]
[{"$nulls":6},{"$f":"IF(E199=\"\",\"\",(VLOOKUP(E199,REALVIEW!$A$2:$C$5000,3,FALSE)))","v":""}]
[{"$nulls":6},{"$f":"IF(E200=\"\",\"\",(VLOOKUP(E200,REALVIEW!$A$2:$C$5000,3,FALSE)))","v":""}]
{"$rows_left_out":800}
{"sheet":"REALVIEW","index":1,"n_rows":3,"n_cols":3,"rows_kept":3}
["Bereich","Breadcrumb_Linie","ID_Struktur"]
["WHG 1","Haus 1 | EG | WHG 1"]
["WHG 2","Haus 1 | OG | WHG 2"]